BDBM50281164 CHEMBL4176277
SMILES [H][C@@]1([#6]-[#6][C@@]2([H])\[#6](-[#6]-[#6]-[#6][C@]12[#6])=[#6]\[#6]=[#6]-1\[#6]-[#6@@H](-[#8])-[#6](=[#6])-[#6@H](-[#8])-[#6]-1)[#6@H](-[#6])-[#6]-[#6]-[#6](=O)-[#6]=[#6]
InChI Key InChIKey=XVGVVMUDYCUDFM-VMKNJNNYSA-N
Data  1 IC50
PDB links: 1 PDB ID matches this monomer.
  Tab Delimited (TSV)   2D SDfile   Computed 3D by Vconf -m prep SDfile
Find this compound or compounds like it in BindingDB:
Activity Spreadsheet -- Enzyme Inhibition Constant Data from BindingDB
Found 1 hit for monomerid = 50281164
TargetVitamin D3 receptor(Homo sapiens (Human))
Showa Pharmaceutical University
Curated by ChEMBL
LigandPNGBDBM50281164(CHEMBL4176277)
Affinity DataIC50:  1.10nM. Assay description: Displacement of [3H]-1,25D3 from C-terminal GST-tagged human recombinant VDR LBD expressed in Escherichia coli BL21 (DE3) after 16 hrs by radioligand...
In DepthDetails ArticlePubMed