BDBM50281583 (S)-3-[(S)-2-((R)-2-Acetylamino-3-phenyl-propionylamino)-5-amino-pentanoylamino]-N-((S)-1-{(1S,2R)-1-[(S)-1-carboxy-2-(1H-indol-3-yl)-ethylcarbamoyl]-2-methyl-butylcarbamoyl}-3-phenyl-propyl)-succinamic acid::CHEMBL444274
SMILES CC[C@@H](C)[C@H](NC(=O)[C@H](CCc1ccccc1)NC(=O)[C@H](CC(O)=O)NC(=O)[C@H](CCCN)NC(=O)[C@@H](Cc1ccccc1)NC(C)=O)C(=O)N[C@@H](Cc1c[nH]c2ccccc12)C(O)=O
InChI Key InChIKey=VGXAMSCQCQQMQQ-HMJYITFPSA-N
Data  1 IC50
  Tab Delimited (TSV)   2D SDfile   Computed 3D by Vconf -m prep SDfile
Find this compound or compounds like it in BindingDB:
Activity Spreadsheet -- Enzyme Inhibition Constant Data from BindingDB
Found 1 hit for monomerid = 50281583
TargetEndothelin-1 receptor(Mus musculus)
TBA
Curated by ChEMBL
LigandPNGBDBM50281583((S)-3-[(S)-2-((R)-2-Acetylamino-3-phenyl-propionyl...)
Affinity DataIC50:  114nM. Assay description: Inhibition of [125I]-ET-1 binding to Endothelin A receptor of murine 3T3 cells
In DepthDetails Article