BDBM50281587 (S)-3-[(R)-2-((R)-2-Acetylamino-3-phenyl-propionylamino)-3-phenyl-propionylamino]-N-((1S,2R)-1-{(1S,2R)-1-[(S)-1-carboxy-2-(1H-indol-3-yl)-ethylcarbamoyl]-2-methyl-butylcarbamoyl}-2-methyl-butyl)-succinamic acid::CHEMBL359235
SMILES CC[C@@H](C)[C@H](NC(=O)[C@H](CC(O)=O)NC(=O)[C@@H](Cc1ccccc1)NC(=O)[C@@H](Cc1ccccc1)NC(C)=O)C(=O)N[C@@H]([C@H](C)CC)C(=O)N[C@@H](Cc1c[nH]c2ccccc12)C(O)=O
InChI Key InChIKey=GNRBLKLDFZWDTC-APRMYQOESA-N
Data  1 IC50
  Tab Delimited (TSV)   2D SDfile   Computed 3D by Vconf -m prep SDfile
Find this compound or compounds like it in BindingDB:
Activity Spreadsheet -- Enzyme Inhibition Constant Data from BindingDB
Found 1 hit for monomerid = 50281587
TargetEndothelin-1 receptor(Mus musculus)
TBA
Curated by ChEMBL
LigandPNGBDBM50281587((S)-3-[(R)-2-((R)-2-Acetylamino-3-phenyl-propionyl...)
Affinity DataIC50:  98nM. Assay description: Inhibition of [125I]-ET-1 binding to Endothelin A receptor of murine 3T3 cells
In DepthDetails Article