BDBM50281626 2-(4-fluorophenyl)-5-(2-naphthylsulfanyl)-1-pentanamine; with Hydrochloric acid::CHEMBL535346
SMILES NCC(CCCSc1ccc2ccccc2c1)c1ccc(F)cc1
InChI Key InChIKey=KRDPPJHKVLHWQK-UHFFFAOYSA-N
Data  3 IC50
  Tab Delimited (TSV)   2D SDfile   Computed 3D by Vconf -m prep SDfile
Find this compound or compounds like it in BindingDB:
Activity Spreadsheet -- Enzyme Inhibition Constant Data from BindingDB
Found 3 hits for monomerid = 50281626
TargetPolyunsaturated fatty acid 5-lipoxygenase(Rattus norvegicus)
TBA
Curated by ChEMBL
LigandPNGBDBM50281626(2-(4-fluorophenyl)-5-(2-naphthylsulfanyl)-1-pentan...)
Affinity DataIC50:  2.30E+4nM. Assay description: Inhibition of rat basophilic leukemia cell 5-lipoxygenase
In DepthDetails Article
TargetProstaglandin G/H synthase 1/2(Ovis aries (Sheep))
TBA
Curated by ChEMBL
LigandPNGBDBM50281626(2-(4-fluorophenyl)-5-(2-naphthylsulfanyl)-1-pentan...)
Affinity DataIC50:  4.70E+4nM. Assay description: Inhibition of ovine seminal vesicle prostaglandin synthetase
In DepthDetails Article
TargetPhospholipase A2(Rattus norvegicus)
TBA
Curated by ChEMBL
LigandPNGBDBM50281626(2-(4-fluorophenyl)-5-(2-naphthylsulfanyl)-1-pentan...)
Affinity DataIC50:  1.40E+4nM. Assay description: Inhibitory activity against polymorphonuclear cell phospholipase-A2 in rat
In DepthDetails Article