BDBM50281730 4-Chloro-N-((S)-1-methyl-2-oxo-5-phenyl-2,3-dihydro-1H-benzo[e][1,4]diazepin-3-yl)-benzamide::CHEMBL168852
SMILES CN1c2ccccc2C(=N[C@H](NC(=O)c2ccc(Cl)cc2)C1=O)c1ccccc1
InChI Key InChIKey=FGWACVODRFNWJZ-OAQYLSRUSA-N
Data  2 IC50
  Tab Delimited (TSV)   2D SDfile   Computed 3D by Vconf -m prep SDfile
Find this compound or compounds like it in BindingDB:
Activity Spreadsheet -- Enzyme Inhibition Constant Data from BindingDB
Found 2 hits for monomerid = 50281730
TargetCholecystokinin receptor type A(RAT)
TBA
Curated by ChEMBL
LigandPNGBDBM50281730(4-Chloro-N-((S)-1-methyl-2-oxo-5-phenyl-2,3-dihydr...)
Affinity DataIC50:  0.390nM. Assay description: The compound was tested for its activity to inhibit the binding of [125I]-CCK-8 to Cholecystokinin type A receptor in rat pancreas
In DepthDetails Article
TargetGastrin/cholecystokinin type B receptor(Homo sapiens (Human))
TBA
Curated by ChEMBL
LigandPNGBDBM50281730(4-Chloro-N-((S)-1-methyl-2-oxo-5-phenyl-2,3-dihydr...)
Affinity DataIC50:  2.90E+3nMpH: 6.5Assay Description:The compound was tested for its activity to inhibit the binding of [125I]-CCK-8 to Cholecystokinin type B receptor in guinea pig brain at a pH of 6.5
In DepthDetails Article