BDBM50281773 CHEMBL176853::Naphthalene-1-carboxylic acid [2-(3,4-dichloro-phenyl)-4-(4-hydroxy-4-phenyl-piperidin-1-yl)-butyl]-methyl-amide
SMILES CN(CC(CCN1CCC(O)(CC1)c1ccccc1)c1ccc(Cl)c(Cl)c1)C(=O)c1cccc2ccccc12
InChI Key InChIKey=LOCWHPYADPPCAK-UHFFFAOYSA-N
Data  1 KI
  Tab Delimited (TSV)   2D SDfile   Computed 3D by Vconf -m prep SDfile
Find this compound or compounds like it in BindingDB:
Activity Spreadsheet -- Enzyme Inhibition Constant Data from BindingDB
Found 1 hit for monomerid = 50281773
TargetSubstance-K receptor(Rattus norvegicus (Rat))
TBA
Curated by ChEMBL
LigandPNGBDBM50281773(CHEMBL176853 | Naphthalene-1-carboxylic acid [2-(3...)
Affinity DataKi:  1.5nM. Assay description: Inhibition of [125I]-NKA binding to neurokinin NK2 receptor from rat duodenum membranes
In DepthDetails Article