BDBM50281892 1-((E)-1,5,9-Trimethyl-deca-4,8-dienyl)-piperidine::CHEMBL417813
SMILES [#6]-[#6](-[#6]-[#6]\[#6]=[#6](/[#6])-[#6]-[#6]\[#6]=[#6](\[#6])-[#6])-[#7]-1-[#6]-[#6]-[#6]-[#6]-[#6]-1
InChI Key InChIKey=WOVQHYQAJNBCIA-SFQUDFHCSA-N
Data  1 IC50
  Tab Delimited (TSV)   2D SDfile   Computed 3D by Vconf -m prep SDfile
Find this compound or compounds like it in BindingDB:
Activity Spreadsheet -- Enzyme Inhibition Constant Data from BindingDB
Found 1 hit for monomerid = 50281892
TargetLanosterol synthase(Rattus norvegicus)
TBA
Curated by ChEMBL
LigandPNGBDBM50281892(1-((E)-1,5,9-Trimethyl-deca-4,8-dienyl)-piperidine...)
Affinity DataIC50:  4.00E+4nM. Assay description: Inhibitory concentration against purified rat liver Oxidosqualene cyclase (OSC)
In DepthDetails Article