BDBM50282197 CHEMBL4171491
SMILES COc1cc2nc(nc(N)c2cc1OC)N1CCC[C@H](C1)NC1=CC(=O)c2ccccc2C1=O
InChI Key InChIKey=ZLHMTVZLNSBOJW-CQSZACIVSA-N
Data  3 KI
  Tab Delimited (TSV)   2D SDfile   Computed 3D by Vconf -m prep SDfile
Find this compound or compounds like it in BindingDB:
Activity Spreadsheet -- Enzyme Inhibition Constant Data from BindingDB
Found 3 hits for monomerid = 50282197
TargetAlpha-1B adrenergic receptor(Homo sapiens (Human))
Alma Mater Studiorum-University Of Bologna
Curated by ChEMBL
LigandPNGBDBM50282197(CHEMBL4171491)
Affinity DataKi:  25nM. Assay description: Displacement of [3H]prazosin from human alpha1B adrenoceptor expressed in CHO cell membranes after 30 mins
In DepthDetails ArticlePubMed
TargetAlpha-1D adrenergic receptor(Homo sapiens (Human))
Alma Mater Studiorum-University Of Bologna
Curated by ChEMBL
LigandPNGBDBM50282197(CHEMBL4171491)
Affinity DataKi:  34nM. Assay description: Displacement of [3H]prazosin from human alpha1D adrenoceptor expressed in CHO cell membranes after 30 mins
In DepthDetails ArticlePubMed
TargetAlpha-1A adrenergic receptor(Homo sapiens (Human))
Alma Mater Studiorum-University Of Bologna
Curated by ChEMBL
LigandPNGBDBM50282197(CHEMBL4171491)
Affinity DataKi:  120nM. Assay description: Displacement of [3H]prazosin from human alpha1A adrenoceptor expressed in CHO cell membranes after 30 mins
In DepthDetails ArticlePubMed