BDBM50282332 4-(2-Ethyl-5,7-dimethyl-imidazo[4,5-b]pyridin-3-ylmethyl)-phenol::CHEMBL63250
SMILES CCc1nc2c(C)cc(C)nc2n1Cc1ccc(O)cc1
InChI Key InChIKey=OURDMTOJDPDHLM-UHFFFAOYSA-N
Data  1 IC50
  Tab Delimited (TSV)   2D SDfile   Computed 3D by Vconf -m prep SDfile
Find this compound or compounds like it in BindingDB:
Activity Spreadsheet -- Enzyme Inhibition Constant Data from BindingDB
Found 1 hit for monomerid = 50282332
TargetType-1 angiotensin II receptor(RABBIT)
TBA
Curated by ChEMBL
LigandPNGBDBM50282332(4-(2-Ethyl-5,7-dimethyl-imidazo[4,5-b]pyridin-3-yl...)
Affinity DataIC50: >3.00E+3nM. Assay description: Binding affinity evaluated by its ability to displace the specific binding ligand 125I-SAR1, Ile8-AII from Angiotensin II receptor, type 1 in rabbit ...
In DepthDetails Article