BDBM50282561 2-(4-Carboxyphenyl)ethyI boronic acid::CHEMBL21123
SMILES OB(O)CCc1ccc(cc1)C(O)=O
InChI Key InChIKey=RHVWEVVYPHHZKS-UHFFFAOYSA-N
Data  1 KI
  Tab Delimited (TSV)   2D SDfile   Computed 3D by Vconf -m prep SDfile
Find this compound or compounds like it in BindingDB:
Activity Spreadsheet -- Enzyme Inhibition Constant Data from BindingDB
Found 1 hit for monomerid = 50282561
TargetBeta-lactamase TEM(Escherichia coli)
TBA
Curated by ChEMBL
LigandPNGBDBM50282561(2-(4-Carboxyphenyl)ethyI boronic acid | CHEMBL2112...)
Affinity DataKi:  4.90E+4nM. Assay description: Inhibitory constant was determined against class A RTEM-1 Beta-lactamase from Escherichia coli
In DepthDetails Article