BDBM50282593 3-(S)-1H-Indol-3-yl-2-[(S)-4-methyl-2-(3-naphthalen-1-yl-1-phosphono-propylamino)-pentanoylamino]-propionic acid::CHEMBL25269
SMILES CC(C)C[C@H](NC(CCc1cccc2ccccc12)P(O)(O)=O)C(=O)N[C@@H](Cc1c[nH]c2ccccc12)C(O)=O
InChI Key InChIKey=CEWALNPBFDYZAE-ZLBDCPSSSA-N
Data  2 IC50
  Tab Delimited (TSV)   2D SDfile   Computed 3D by Vconf -m prep SDfile
Find this compound or compounds like it in BindingDB:
Activity Spreadsheet -- Enzyme Inhibition Constant Data from BindingDB
Found 2 hits for monomerid = 50282593
TargetEndothelin-converting enzyme 1(Bos taurus)
TBA
Curated by ChEMBL
LigandPNGBDBM50282593(3-(S)-1H-Indol-3-yl-2-[(S)-4-methyl-2-(3-naphthale...)
Affinity DataIC50:  260nM. Assay description: Inhibition of Endothelin-converting enzyme (ECE) from microsomal fractions of bovine cultured endothelial cells
In DepthDetails Article
TargetNeprilysin(Rattus norvegicus (Rat))
TBA
Curated by ChEMBL
LigandPNGBDBM50282593(3-(S)-1H-Indol-3-yl-2-[(S)-4-methyl-2-(3-naphthale...)
Affinity DataIC50:  140nM. Assay description: Inhibitory activity against neutral endopeptidase (NEP)prepared from microsomal fractions of rat small intestine
In DepthDetails Article