BDBM50282597 (3S,4S)-5-Cyclohexyl-3-hydroxy-4-((S)-4-methyl-2-{(S)-2-[4-(3-oxo-2,3-dihydro-pyrido[4,3-b][1,4]thiazin-4-yl)-butyrylamino]-3-phenyl-propionylamino}-pentanoylamino)-pentanoic acid (3-imidazol-1-yl-propyl)-amide::CHEMBL24315
SMILES CC(C)C[C@H](NC(=O)[C@H](Cc1ccccc1)NC(=O)CCCN1C(=O)CSc2ccncc12)C(=O)N[C@@H](CC1CCCCC1)[C@@H](O)CC(=O)NCCCn1ccnc1
InChI Key InChIKey=IFRIKYZYDZSYCR-SZHYKVQFSA-N
Data  1 IC50
  Tab Delimited (TSV)   2D SDfile   Computed 3D by Vconf -m prep SDfile
Find this compound or compounds like it in BindingDB:
Activity Spreadsheet -- Enzyme Inhibition Constant Data from BindingDB
Found 1 hit for monomerid = 50282597
TargetRenin(Homo sapiens (Human))
TBA
Curated by ChEMBL
LigandPNGBDBM50282597((3S,4S)-5-Cyclohexyl-3-hydroxy-4-((S)-4-methyl-2-{...)
Affinity DataIC50:  14nM. Assay description: Inhibition of human plasma renin at pH 65.0
In DepthDetails Article