BDBM50282608 (3S,4S)-5-Cyclohexyl-4-((S)-2-{(S)-2-[2-(1,1-dioxo-2,3-dihydro-1H-1lambda*6*-benzo[b]thiophen-3-yl)-acetylamino]-3-phenyl-propionylamino}-4-methyl-pentanoylamino)-3-hydroxy-pentanoic acid (2-morpholin-4-yl-ethyl)-amide::CHEMBL290732
SMILES CC(C)C[C@H](NC(=O)[C@H](Cc1ccccc1)NC(=O)CC1CS(=O)(=O)c2ccccc12)C(=O)N[C@@H](CC1CCCCC1)[C@@H](O)CC(=O)NCCN1CCOCC1
InChI Key InChIKey=HSBFPNJJFXWUSD-OINPDUSQSA-N
Data  1 IC50
  Tab Delimited (TSV)   2D SDfile   Computed 3D by Vconf -m prep SDfile
Find this compound or compounds like it in BindingDB:
Activity Spreadsheet -- Enzyme Inhibition Constant Data from BindingDB
Found 1 hit for monomerid = 50282608
TargetRenin(Homo sapiens (Human))
TBA
Curated by ChEMBL
LigandPNGBDBM50282608((3S,4S)-5-Cyclohexyl-4-((S)-2-{(S)-2-[2-(1,1-dioxo...)
Affinity DataIC50:  170nM. Assay description: Inhibition of human plasma renin at pH 65.0
In DepthDetails Article