BDBM50282657 CHEMBL29668::[(2S,3R)-2-(2-Hydroxy-ethyl)-5-oxo-tetrahydro-furan-3-yl]-acetic acid tetradecyl ester
SMILES CCCCCCCCCCCCCCOC(=O)C[C@@H]1CC(=O)O[C@H]1CCO
InChI Key InChIKey=FSSNMMADRZKZJV-UXHICEINSA-N
Data  1 KI
  Tab Delimited (TSV)   2D SDfile   Computed 3D by Vconf -m prep SDfile
Find this compound or compounds like it in BindingDB:
Activity Spreadsheet -- Enzyme Inhibition Constant Data from BindingDB
Found 1 hit for monomerid = 50282657
TargetProtein kinase C alpha type(Rattus norvegicus (Rat))
TBA
Curated by ChEMBL
LigandPNGBDBM50282657(CHEMBL29668 | [(2S,3R)-2-(2-Hydroxy-ethyl)-5-oxo-t...)
Affinity DataKi:  1.86E+4nM. Assay description: Inhibition of [3H]-PDBU binding to Protein kinase C alpha
In DepthDetails Article