BDBM50282716 (S)-2-((1R,2S)-2-tert-Butoxycarbonylamino-1-cyano-3-phenyl-propylamino)-3-phenyl-propionic acid methyl ester::CHEMBL34258
SMILES COC(=O)[C@H](Cc1ccccc1)N[C@H](C#N)[C@H](Cc1ccccc1)NC(=O)OC(C)(C)C
InChI Key InChIKey=HPDYOURFEFGYIQ-FDFHNCONSA-N
Data  2 IC50
  Tab Delimited (TSV)   2D SDfile   Computed 3D by Vconf -m prep SDfile
Find this compound or compounds like it in BindingDB:
Activity Spreadsheet -- Enzyme Inhibition Constant Data from BindingDB
Found 2 hits for monomerid = 50282716
TargetAminopeptidase B(Mus musculus)
TBA
Curated by ChEMBL
LigandPNGBDBM50282716((S)-2-((1R,2S)-2-tert-Butoxycarbonylamino-1-cyano-...)
Affinity DataIC50:  1.00E+6nM. Assay description: Inhibition of Aminopeptidase B in murine L-cells by Aoyagi method.
In DepthDetails Article
TargetAminopeptidase N(Homo sapiens (Human))
TBA
Curated by ChEMBL
LigandPNGBDBM50282716((S)-2-((1R,2S)-2-tert-Butoxycarbonylamino-1-cyano-...)
Affinity DataIC50:  1.00E+6nM. Assay description: Inhibition of Aminopeptidase M.
In DepthDetails Article