BDBM50282990 CHEMBL59973::Morpholine-4-carboxylic acid ((S)-1-{(R)-1-[(1S,2S)-1-cyclohexylmethyl-2-hydroxy-2-(2-oxo-2lambda*5*-[1,3,2]dioxaphosphinan-2-yl)-ethylcarbamoyl]-2-methylsulfanyl-ethylcarbamoyl}-2-phenyl-ethyl)-amide
SMILES CSC[C@H](NC(=O)[C@H](Cc1ccccc1)NC(=O)N1CCOCC1)C(=O)N[C@@H](CC1CCCCC1)[C@@H](O)P1(=O)OCCCO1
InChI Key InChIKey=HRNBOFCWYIICIY-VZTVMPNDSA-N
Data  3 IC50
  Tab Delimited (TSV)   2D SDfile   Computed 3D by Vconf -m prep SDfile
Find this compound or compounds like it in BindingDB:
Activity Spreadsheet -- Enzyme Inhibition Constant Data from BindingDB
Found 3 hits for monomerid = 50282990
TargetRenin(Homo sapiens (Human))
TBA
Curated by ChEMBL
LigandPNGBDBM50282990(CHEMBL59973 | Morpholine-4-carboxylic acid ((S)-1-...)
Affinity DataIC50:  8.40nM. Assay description: Compound was tested for the inhibition of guinea pig plasma renin
In DepthDetails Article
TargetRenin(Homo sapiens (Human))
TBA
Curated by ChEMBL
LigandPNGBDBM50282990(CHEMBL59973 | Morpholine-4-carboxylic acid ((S)-1-...)
Affinity DataIC50:  0.600nM. Assay description: Compound was tested for the inhibition of human plasma renin(Hu Renin)
In DepthDetails Article
TargetRenin(Homo sapiens (Human))
TBA
Curated by ChEMBL
LigandPNGBDBM50282990(CHEMBL59973 | Morpholine-4-carboxylic acid ((S)-1-...)
Affinity DataIC50:  0.200nM. Assay description: Compound was tested for the inhibition of human plasma renin(Hu Renin)
In DepthDetails Article