BDBM50283072 (2E,4E,6E,8E)-3,7-Dimethyl-9-(2,6,6-trimethyl-cyclohex-1-enyl)-nona-2,4,6,8-tetraenoic acid (3,4,5-trihydroxy-6-hydroxymethyl-tetrahydro-pyran-2-yl)-amide::CHEMBL66228
SMILES C\C(\C=C\C1=C(C)CCCC1(C)C)=C/C=C/C(/C)=C/C(=O)NC1OC(CO)C(O)C(O)C1O
InChI Key InChIKey=DKHIHVMIFWYQLD-VTLMDCEISA-N
Data  1 KI
  Tab Delimited (TSV)   2D SDfile   Computed 3D by Vconf -m prep SDfile
Find this compound or compounds like it in BindingDB:
Activity Spreadsheet -- Enzyme Inhibition Constant Data from BindingDB
Found 1 hit for monomerid = 50283072
TargetRetinoic acid receptor gamma(Homo sapiens (Human))
TBA
Curated by ChEMBL
LigandPNGBDBM50283072((2E,4E,6E,8E)-3,7-Dimethyl-9-(2,6,6-trimethyl-cycl...)
Affinity DataKi:  710nM. Assay description: Inhibition of [3H]-RA to binding Retinoic acid receptor RAR gamma
In DepthDetails Article