BDBM50283540 (S)-2-{3-[((R)-2-Amino-3-mercapto-propionylamino)-methyl]-benzoylamino}-4-methylsulfanyl-butyric acid anion
SMILES CSCC[C@H](NC(=O)c1cccc(CNC(=O)[C@@H]([NH3+])CS)c1)C([O-])=O
InChI Key InChIKey=GHRUAXWYPNULNT-STQMWFEESA-N
Data  3 IC50
  Tab Delimited (TSV)   2D SDfile   Computed 3D by Vconf -m prep SDfile
Find this compound or compounds like it in BindingDB:
Activity Spreadsheet -- Enzyme Inhibition Constant Data from BindingDB
Found 3 hits for monomerid = 50283540
LigandPNGBDBM50283540((S)-2-{3-[((R)-2-Amino-3-mercapto-propionylamino)-...)
Affinity DataIC50:  350nM. Assay description: Inhibition of farnesyl transferase
In DepthDetails Article
LigandPNGBDBM50283540((S)-2-{3-[((R)-2-Amino-3-mercapto-propionylamino)-...)
Affinity DataIC50:  1.84E+4nM. Assay description: Inhibitory activity against geranylgeranyl transferase
In DepthDetails Article
LigandPNGBDBM50283540((S)-2-{3-[((R)-2-Amino-3-mercapto-propionylamino)-...)
Affinity DataIC50:  380nM. Assay description: In vitro inhibition of [3H]FPP incorporation into recombinant P21ras of NIH3T3 cells by farnesyl transferase
In DepthDetails Article