BDBM50283592 2-Ethyl-4-[4'-methyl-2'-(2H-tetrazol-5-yl)-biphenyl-4-ylmethoxy]-5,6,7,8-tetrahydro-quinoline::CHEMBL89614
SMILES CCc1cc(OCc2ccc(cc2)-c2ccc(C)cc2-c2nnn[nH]2)c2CCCCc2n1
InChI Key InChIKey=YCHCSDRQYNIEBW-UHFFFAOYSA-N
Data  1 IC50
  Tab Delimited (TSV)   2D SDfile   Computed 3D by Vconf -m prep SDfile
Find this compound or compounds like it in BindingDB:
Activity Spreadsheet -- Enzyme Inhibition Constant Data from BindingDB
Found 1 hit for monomerid = 50283592
TargetType-1 angiotensin II receptor(Cavia porcellus)
TBA
Curated by ChEMBL
LigandPNGBDBM50283592(2-Ethyl-4-[4'-methyl-2'-(2H-tetrazol-5-yl)-bipheny...)
Affinity DataIC50:  54nM. Assay description: Compound was tested for in vitro inhibition of specific binding of [I-125]AII to Angiotensin II receptor, type 1 in guinea pig adrenal membrane prepa...
In DepthDetails Article