BDBM50283599 5,7a-Bis-hydroxymethyl-3-phenylamino-2,4a,5,6,7,7a-hexahydro-cyclopenta[1,4]oxazine-5,6,7-triol::CHEMBL314403
SMILES OCC1(O)C(O)C(O)C2(CO)OCC(Nc3ccccc3)=NC12
InChI Key InChIKey=VCQTVMUCIZQHEV-UHFFFAOYSA-N
Data  5 IC50
  Tab Delimited (TSV)   2D SDfile   Computed 3D by Vconf -m prep SDfile
Find this compound or compounds like it in BindingDB:
Activity Spreadsheet -- Enzyme Inhibition Constant Data from BindingDB
Found 5 hits for monomerid = 50283599
TargetLysosomal alpha-glucosidase(Bos taurus)
TBA
Curated by ChEMBL
LigandPNGBDBM50283599(5,7a-Bis-hydroxymethyl-3-phenylamino-2,4a,5,6,7,7a...)
Affinity DataIC50:  2.39E+4nM. Assay description: Inhibitory activity was determined against bovine liver beta galactosidase
In DepthDetails Article
TargetLysosomal acid glucosylceramidase(Homo sapiens (Human))
TBA
Curated by ChEMBL
LigandPNGBDBM50283599(5,7a-Bis-hydroxymethyl-3-phenylamino-2,4a,5,6,7,7a...)
Affinity DataIC50:  2.11E+5nM. Assay description: Inhibitory activity was determined against almonds Beta-glucosidase
In DepthDetails Article
TargetLysosomal acid glucosylceramidase(Homo sapiens (Human))
TBA
Curated by ChEMBL
LigandPNGBDBM50283599(5,7a-Bis-hydroxymethyl-3-phenylamino-2,4a,5,6,7,7a...)
Affinity DataIC50: >3.00E+5nM. Assay description: Inhibitory activity was determined against Escherichia coli beta galactosidase
In DepthDetails Article
TargetLysosomal alpha-glucosidase(Homo sapiens (Human))
TBA
Curated by ChEMBL
LigandPNGBDBM50283599(5,7a-Bis-hydroxymethyl-3-phenylamino-2,4a,5,6,7,7a...)
Affinity DataIC50: >1.18E+5nM. Assay description: Inhibitory activity was determined against Escherichia coli Alpha-galactosidase
In DepthDetails Article
TargetLysosomal alpha-glucosidase(Homo sapiens (Human))
TBA
Curated by ChEMBL
LigandPNGBDBM50283599(5,7a-Bis-hydroxymethyl-3-phenylamino-2,4a,5,6,7,7a...)
Affinity DataIC50: >3.00E+5nM. Assay description: Inhibitory activity was determined against baker's yeast Alpha-Glucosidase
In DepthDetails Article