BDBM50283721 CHEMBL93082::{(S)-1-[(1S,2R)-1-Benzyl-3-((S)-2-tert-butylcarbamoyl-piperidin-1-yl)-2-hydroxy-propylcarbamoyl]-2-carbamoyl-ethyl}-carbamic acid benzyl ester
SMILES CC(C)(C)NC(=O)[C@@H]1CCCCN1C[C@@H](O)[C@H](Cc1ccccc1)NC(=O)[C@H](CC(N)=O)NC(=O)OCc1ccccc1
InChI Key InChIKey=WWANYGDDKRZWHZ-YIPNQBBMSA-N
Data  3 IC50
  Tab Delimited (TSV)   2D SDfile   Computed 3D by Vconf -m prep SDfile
Find this compound or compounds like it in BindingDB:
Activity Spreadsheet -- Enzyme Inhibition Constant Data from BindingDB
Found 3 hits for monomerid = 50283721
TargetGag-Pol polyprotein [489-587](Human immunodeficiency virus type 1)
Washington University
Curated by ChEMBL
LigandPNGBDBM50283721(CHEMBL93082 | {(S)-1-[(1S,2R)-1-Benzyl-3-((S)-2-te...)
Affinity DataIC50:  18nM. Assay description: Inhibitory potency against HIV-1 protease
In DepthDetails ArticlePubMed
TargetGag-Pol polyprotein [489-587](Human immunodeficiency virus type 1)
Washington University
Curated by ChEMBL
LigandPNGBDBM50283721(CHEMBL93082 | {(S)-1-[(1S,2R)-1-Benzyl-3-((S)-2-te...)
Affinity DataIC50:  18nM. Assay description: Inhibitory activity against HIV-1 Protease was determined
In DepthDetails Article
TargetGag-Pol polyprotein [489-587](Human immunodeficiency virus type 1)
Washington University
Curated by ChEMBL
LigandPNGBDBM50283721(CHEMBL93082 | {(S)-1-[(1S,2R)-1-Benzyl-3-((S)-2-te...)
Affinity DataIC50:  18nM. Assay description: Inhibitory activity of the Compound was tested against HIV protease enzyme.(value reported by Roche group)
In DepthDetails ArticlePubMed