BDBM50283743 (S)-2-{[5-((R)-2-Amino-3-mercapto-propionylamino)-5,6,7,8-tetrahydro-naphthalene-1-carbonyl]-amino}-4-methylsulfanyl-butyric acid::CHEMBL316830
SMILES CSCC[C@H](NC(=O)c1cccc2C(CCCc12)NC(=O)[C@@H](N)CS)C(O)=O
InChI Key InChIKey=UZIWHKQLPXQKNL-AQOJYXMDSA-N
Data  2 IC50
  Tab Delimited (TSV)   2D SDfile   Computed 3D by Vconf -m prep SDfile
Find this compound or compounds like it in BindingDB:
Activity Spreadsheet -- Enzyme Inhibition Constant Data from BindingDB
Found 2 hits for monomerid = 50283743
LigandPNGBDBM50283743((S)-2-{[5-((R)-2-Amino-3-mercapto-propionylamino)-...)
Affinity DataIC50:  1.86E+4nM. Assay description: Inhibitory activity against geranylgeranyl transferase
In DepthDetails Article
LigandPNGBDBM50283743((S)-2-{[5-((R)-2-Amino-3-mercapto-propionylamino)-...)
Affinity DataIC50:  940nM. Assay description: Inhibition of farnesyl transferase
In DepthDetails Article