BDBM50283745 (S)-2-[5-((R)-2-Amino-3-mercapto-propionylamino)-2-(4-methoxy-benzyl)-pentanoylamino]-4-methylsulfanyl-butyric acid::CHEMBL95025
SMILES COc1ccc(CC(CCCNC(=O)[C@@H](N)CS)C(=O)N[C@@H](CCSC)C(O)=O)cc1
InChI Key InChIKey=XSAVTNXMPFIQMO-BEEDKBRMSA-N
Data  2 IC50
  Tab Delimited (TSV)   2D SDfile   Computed 3D by Vconf -m prep SDfile
Find this compound or compounds like it in BindingDB:
Activity Spreadsheet -- Enzyme Inhibition Constant Data from BindingDB
Found 2 hits for monomerid = 50283745
LigandPNGBDBM50283745((S)-2-[5-((R)-2-Amino-3-mercapto-propionylamino)-2...)
Affinity DataIC50:  1.12E+3nM. Assay description: Inhibitory activity against geranylgeranyl transferase
In DepthDetails Article
LigandPNGBDBM50283745((S)-2-[5-((R)-2-Amino-3-mercapto-propionylamino)-2...)
Affinity DataIC50:  170nM. Assay description: Inhibition of farnesyl transferase
In DepthDetails Article