BDBM50283901 CHEMBL335931::Staurosporine derivative
SMILES CO[C@H]1[C@H](C[C@@H]2O[C@@]1(C)n1c3ccccc3c3c4CNC(=O)c4c4c5ccccc5n2c4c13)N(C)C(=O)CNC(=O)OC(C)(C)C
InChI Key InChIKey=NRUVICOXXLOXCB-YACNBPEVSA-N
Data  2 IC50
  Tab Delimited (TSV)   2D SDfile   Computed 3D by Vconf -m prep SDfile
Find this compound or compounds like it in BindingDB:
Activity Spreadsheet -- Enzyme Inhibition Constant Data from BindingDB
Found 2 hits for monomerid = 50283901
TargetEpidermal growth factor receptor(Homo sapiens (Human))
TBA
Curated by ChEMBL
LigandPNGBDBM50283901(CHEMBL335931 | Staurosporine derivative)
Affinity DataIC50:  3.50E+3nM. Assay description: Inhibitory activity against protein tyrosine kinase of Epidermal growth factor receptor was determined
In DepthDetails Article
TargetProto-oncogene tyrosine-protein kinase Src(Homo sapiens (Human))
TBA
Curated by ChEMBL
LigandPNGBDBM50283901(CHEMBL335931 | Staurosporine derivative)
Affinity DataIC50:  160nM. Assay description: Inhibition of Src tyrosine kinase
In DepthDetails Article