BDBM50283917 1-(1,1-Diphenyl-silolan-3-yl)-4-(4-fluoro-phenyl)-piperazine::CHEMBL337226
SMILES Fc1ccc(cc1)N1CCN(CC1)C1CC[Si](C1)(c1ccccc1)c1ccccc1
InChI Key InChIKey=SSIMRFYYUFVKNG-UHFFFAOYSA-N
Data  1 IC50
  Tab Delimited (TSV)   2D SDfile   Computed 3D by Vconf -m prep SDfile
Find this compound or compounds like it in BindingDB:
Activity Spreadsheet -- Enzyme Inhibition Constant Data from BindingDB
Found 1 hit for monomerid = 50283917
Target5-hydroxytryptamine receptor 2A(Rattus norvegicus (rat))
TBA
Curated by ChEMBL
LigandPNGBDBM50283917(1-(1,1-Diphenyl-silolan-3-yl)-4-(4-fluoro-phenyl)-...)
Affinity DataIC50:  0.900nM. Assay description: In vitro binding affinity towards serotonin 5-HT2A receptor in rat cortical membranes using [3H]ketanserin as radioligand
In DepthDetails Article