BDBM50284027 CHEMBL4170029
SMILES COc1cc2nc(nc(N)c2cc1OC)N1CCN(CC1)C(=O)CCCCCCCCCCC(=O)N1CCN(CC1)c1nc(N)c2cc(OC)c(OC)cc2n1
InChI Key InChIKey=AXGMLJIZBIZLQP-UHFFFAOYSA-N
Data  1 IC50
  Tab Delimited (TSV)   2D SDfile   Computed 3D by Vconf -m prep SDfile
Find this compound or compounds like it in BindingDB:
Activity Spreadsheet -- Enzyme Inhibition Constant Data from BindingDB
Found 1 hit for monomerid = 50284027
TargetAlpha-1A adrenergic receptor(Rattus norvegicus (Rat))
Case Western Reserve University School Of Medicine
Curated by ChEMBL
LigandPNGBDBM50284027(CHEMBL4170029)
Affinity DataIC50:  2.5nM. Assay description: Displacement of [3H]-prazosin from rat alpha1A adrenergic receptor after 60 mins by scintillation counting analysis
In DepthDetails ArticlePubMed