BDBM50284805 2-((5R,6S)-9-Bromo-6-ethyl-2,3-dioxo-2,3,6,7-tetrahydro-1H,5H-pyrido[1,2,3-de]quinoxalin-5-yl)-N-phenyl-acetamide::CHEMBL40072
SMILES CC[C@H]1Cc2cc(Br)cc3[nH]c(=O)c(=O)n([C@@H]1CC(=O)Nc1ccccc1)c23
InChI Key InChIKey=DHIWARIOXGZEJJ-YVEFUNNKSA-N
Data  1 KI
  Tab Delimited (TSV)   2D SDfile   Computed 3D by Vconf -m prep SDfile
Find this compound or compounds like it in BindingDB:
Activity Spreadsheet -- Enzyme Inhibition Constant Data from BindingDB
Found 1 hit for monomerid = 50284805
LigandPNGBDBM50284805(2-((5R,6S)-9-Bromo-6-ethyl-2,3-dioxo-2,3,6,7-tetra...)
Affinity DataKi:  3.80nM. Assay description: Affinity measured by using [3H]5,7-dichlorokynurenic acid (DCKA) for the glycine binding site of NMDA receptor
In DepthDetails Article