BDBM50285056 CHEMBL61284::methyl 1-amino(thioxo)methyl-4-(3-cyclopentyloxy-4-methoxyphenyl)-(3S,4R)-tetrahydro-1H-3-pyrrolecarboxylate
SMILES COC(=O)[C@@H]1CN(C[C@H]1c1ccc(OC)c(OC2CCCC2)c1)C(N)=S
InChI Key InChIKey=VUVAXWZQOZIXEJ-LSDHHAIUSA-N
Data  1 KI
  Tab Delimited (TSV)   2D SDfile   Computed 3D by Vconf -m prep SDfile
Find this compound or compounds like it in BindingDB:
Activity Spreadsheet -- Enzyme Inhibition Constant Data from BindingDB
Found 1 hit for monomerid = 50285056
TargetcAMP-specific 3',5'-cyclic phosphodiesterase 4B(Homo sapiens (Human))
TBA
Curated by ChEMBL
LigandPNGBDBM50285056(CHEMBL61284 | methyl 1-amino(thioxo)methyl-4-(3-cy...)
Affinity DataKi:  380nM. Assay description: Ability to inhibit the catalytic activity of human Phosphodiesterase 4B (PDE IVB)
In DepthDetails Article