BDBM50285077 2-Hydroxymethyl-6-((S)-2,5,5,8a-tetramethyl-3,4,4a,5,6,7,8,8a-octahydro-naphthalen-1-ylmethyl)-phenol::CHEMBL64817
SMILES CC1=C(Cc2cccc(CO)c2O)[C@@]2(C)CCCC(C)(C)C2CC1
InChI Key InChIKey=IGMDJXNGTXPFSD-AVKWCDSFSA-N
Data  1 IC50
  Tab Delimited (TSV)   2D SDfile   Computed 3D by Vconf -m prep SDfile
Find this compound or compounds like it in BindingDB:
Activity Spreadsheet -- Enzyme Inhibition Constant Data from BindingDB
Found 1 hit for monomerid = 50285077
TargetCholesteryl ester transfer protein(Homo sapiens (Human))
TBA
Curated by ChEMBL
LigandPNGBDBM50285077(2-Hydroxymethyl-6-((S)-2,5,5,8a-tetramethyl-3,4,4a...)
Affinity DataIC50: >5.00E+4nM. Assay description: Inhibition of Cholesterol ester transfer protein (CETP)
In DepthDetails Article