BDBM50285926 2-(3,5-Bis-trifluoromethyl-benzyloxy)-1-methyl-1-phenyl-ethylamine::CHEMBL92524
SMILES CC(N)(COCc1cc(cc(c1)C(F)(F)F)C(F)(F)F)c1ccccc1
InChI Key InChIKey=UOKDYNBXNQDFQD-UHFFFAOYSA-N
Data  1 IC50
  Tab Delimited (TSV)   2D SDfile   Computed 3D by Vconf -m prep SDfile
Find this compound or compounds like it in BindingDB:
Activity Spreadsheet -- Enzyme Inhibition Constant Data from BindingDB
Found 1 hit for monomerid = 50285926
TargetSubstance-P receptor(Homo sapiens (Human))
TBA
Curated by ChEMBL
LigandPNGBDBM50285926(2-(3,5-Bis-trifluoromethyl-benzyloxy)-1-methyl-1-p...)
Affinity DataIC50:  30nM. Assay description: Binding affinity to human Tachykinin receptor 1
In DepthDetails Article