BDBM50285949 CHEMBL97140::N*6*-(4-Chloro-phenyl)-8-isopropyl-N*2*-propyl-9H-purine-2,6-diamine
SMILES CCCNc1nc(Nc2ccc(Cl)cc2)c2[nH]c(nc2n1)C(C)C
InChI Key InChIKey=GNPVEPKPNLXABB-UHFFFAOYSA-N
Data  1 KI
  Tab Delimited (TSV)   2D SDfile   Computed 3D by Vconf -m prep SDfile
Find this compound or compounds like it in BindingDB:
Activity Spreadsheet -- Enzyme Inhibition Constant Data from BindingDB
Found 1 hit for monomerid = 50285949
TargetSubstance-K receptor(Homo sapiens (Human))
TBA
Curated by ChEMBL
LigandPNGBDBM50285949(CHEMBL97140 | N*6*-(4-Chloro-phenyl)-8-isopropyl-N...)
Affinity DataKi:  3.49E+3nM. Assay description: Displacement of [3H]-NKA from the cloned human Tachykinin receptor 2 which has been expressed in baculovirus infected insect sf21 cells
In DepthDetails Article