BDBM50285998 6-(4-Fluoro-phenyl)-3-(3-pyridin-3-yl-1H-pyrrolo[1,2-c]thiazole-7-carbonyl)-indole-1-carboxylic acid hydrazide::CHEMBL420826
SMILES NNC(=O)n1cc(C(=O)c2ccn3C(SCc23)c2cccnc2)c2ccc(cc12)-c1ccc(F)cc1
InChI Key InChIKey=FAYZFXYNZAPSSY-UHFFFAOYSA-N
Data  1 KI
  Tab Delimited (TSV)   2D SDfile   Computed 3D by Vconf -m prep SDfile
Find this compound or compounds like it in BindingDB:
Activity Spreadsheet -- Enzyme Inhibition Constant Data from BindingDB
Found 1 hit for monomerid = 50285998
TargetPlatelet-activating factor receptor(Cavia porcellus)
TBA
Curated by ChEMBL
LigandPNGBDBM50285998(6-(4-Fluoro-phenyl)-3-(3-pyridin-3-yl-1H-pyrrolo[1...)
Affinity DataKi:  25nM. Assay description: Tested in vitro for antagonistic activity to displace [3H]-PAF from rabbit platelet membrane PAF receptors
In DepthDetails Article