BDBM50286186 (S)-2-{(S)-2-[(S)-2-(2-Hydroxy-5-trifluoromethyl-benzylamino)-3-methyl-butyrylamino]-3-phenyl-propionylamino}-4-methylsulfanyl-butyric acid; hydrochloride::CHEMBL544802
SMILES CSCC[C@H](NC(=O)[C@H](Cc1ccccc1)NC(=O)[C@@H](NCc1cc(ccc1O)C(F)(F)F)C(C)C)C(O)=O
InChI Key InChIKey=IGIPEGPQBIUKSE-FUDKSRODSA-N
Data  1 IC50
  Tab Delimited (TSV)   2D SDfile   Computed 3D by Vconf -m prep SDfile
Find this compound or compounds like it in BindingDB:
Activity Spreadsheet -- Enzyme Inhibition Constant Data from BindingDB
Found 1 hit for monomerid = 50286186
LigandPNGBDBM50286186((S)-2-{(S)-2-[(S)-2-(2-Hydroxy-5-trifluoromethyl-b...)
Affinity DataIC50:  2.10E+3nM. Assay description: Inhibition of farnesyl transferase
In DepthDetails Article