BDBM50286235 CHEMBL313184::[8-(1H-Indol-3-ylmethyl)-11-oxo-5-propyl-5,11-dihydro-dibenzo[b,e][1,4]diazepin-10-yl]-acetic acid
SMILES CCCN1c2ccc(Cc3c[nH]c4ccccc34)cc2N(CC(O)=O)C(=O)c2ccccc12
InChI Key InChIKey=IVZAYUAZBDJOED-UHFFFAOYSA-N
Data  2 KI
  Tab Delimited (TSV)   2D SDfile   Computed 3D by Vconf -m prep SDfile
Find this compound or compounds like it in BindingDB:
Activity Spreadsheet -- Enzyme Inhibition Constant Data from BindingDB
Found 2 hits for monomerid = 50286235
TargetEndothelin receptor type B(RAT)
TBA
Curated by ChEMBL
LigandPNGBDBM50286235(CHEMBL313184 | [8-(1H-Indol-3-ylmethyl)-11-oxo-5-p...)
Affinity DataKi:  1.20E+4nM. Assay description: Affinity against ET B receptor
In DepthDetails Article
TargetEndothelin-1 receptor(Homo sapiens (Human))
TBA
Curated by ChEMBL
LigandPNGBDBM50286235(CHEMBL313184 | [8-(1H-Indol-3-ylmethyl)-11-oxo-5-p...)
Affinity DataKi:  4.10E+4nM. Assay description: Affinity against ET A receptor
In DepthDetails Article