BDBM50286504 CHEMBL435594::{(1S,2R)-1-Benzyl-2-hydroxy-3-[(2R,3S)-2-hydroxy-3-(1-hydroxymethyl-cyclobutoxycarbonylamino)-4-phenyl-butylamino]-propyl}-carbamic acid tert-butyl ester
SMILES CC(C)(C)OC(=O)N[C@@H](Cc1ccccc1)[C@H](O)CNC[C@@H](O)[C@H](Cc1ccccc1)NC(=O)OC1(CO)CCC1
InChI Key InChIKey=GWOLGQLCRSIHJT-GWMMUDDPSA-N
Data  1 IC50
  Tab Delimited (TSV)   2D SDfile   Computed 3D by Vconf -m prep SDfile
Find this compound or compounds like it in BindingDB:
Activity Spreadsheet -- Enzyme Inhibition Constant Data from BindingDB
Found 1 hit for monomerid = 50286504
TargetGag-Pol polyprotein [489-587](Human immunodeficiency virus type 1)
TBA
Curated by ChEMBL
LigandPNGBDBM50286504(CHEMBL435594 | {(1S,2R)-1-Benzyl-2-hydroxy-3-[(2R,...)
Affinity DataIC50:  100nM. Assay description: Inhibition of HIV protease cleavage of V-S-Q-N-(b-naphthylalanine)-P-I-V
In DepthDetails Article