BDBM50286521 Phosphoric acid (1R,2R,4R,6R)-2,4-dihydroxy-6-(3-phenyl-propoxy)-cyclohexyl ester isopropyl ester
SMILES CC(C)OP([O-])(=O)O[C@@H]1[C@H](O)C[C@@H](O)C[C@H]1OCCCCc1ccccc1O
InChI Key InChIKey=ZIZUULAERLBYND-NXWXRZEISA-M
Data  1 IC50
  Tab Delimited (TSV)   2D SDfile   Computed 3D by Vconf -m prep SDfile
Find this compound or compounds like it in BindingDB:
Activity Spreadsheet -- Enzyme Inhibition Constant Data from BindingDB
Found 1 hit for monomerid = 50286521
TargetInositol monophosphatase 1(Bos taurus)
TBA
Curated by ChEMBL
LigandPNGBDBM50286521(Phosphoric acid (1R,2R,4R,6R)-2,4-dihydroxy-6-(3-p...)
Affinity DataIC50:  5.00E+4nM. Assay description: Inhibitory activity against myo-inositol-1-phosphatase
In DepthDetails Article