BDBM50286570 2-(2-Benzyl-5-o-tolyl-thiazol-4-yl)-pyridine::CHEMBL151334
SMILES Cc1ccccc1-c1sc(Cc2ccccc2)nc1-c1ccccn1
InChI Key InChIKey=XNLYXHJWZJEYBT-UHFFFAOYSA-N
Data  1 IC50
  Tab Delimited (TSV)   2D SDfile   Computed 3D by Vconf -m prep SDfile
Find this compound or compounds like it in BindingDB:
Activity Spreadsheet -- Enzyme Inhibition Constant Data from BindingDB
Found 1 hit for monomerid = 50286570
TargetPotassium-transporting ATPase alpha chain 1(Sus scrofa (Pig))
TBA
Curated by ChEMBL
LigandPNGBDBM50286570(2-(2-Benzyl-5-o-tolyl-thiazol-4-yl)-pyridine | CHE...)
Affinity DataIC50:  9.60E+3nM. Assay description: Ability to inhibit H+/K+ stimulated ATPase activity in lympholised gastric vesicles
In DepthDetails Article