BDBM50286573 CHEMBL149912::Methyl-[6-(2-propyl-5-o-tolyl-thiazol-4-yl)-pyridin-2-yl]-amine
SMILES CCCc1nc(c(s1)-c1ccccc1C)-c1cccc(NC)n1
InChI Key InChIKey=QEMLOOPVVLUETE-UHFFFAOYSA-N
Data  1 IC50
  Tab Delimited (TSV)   2D SDfile   Computed 3D by Vconf -m prep SDfile
Find this compound or compounds like it in BindingDB:
Activity Spreadsheet -- Enzyme Inhibition Constant Data from BindingDB
Found 1 hit for monomerid = 50286573
TargetPotassium-transporting ATPase alpha chain 1(Sus scrofa (Pig))
TBA
Curated by ChEMBL
LigandPNGBDBM50286573(CHEMBL149912 | Methyl-[6-(2-propyl-5-o-tolyl-thiaz...)
Affinity DataIC50:  1.25E+4nM. Assay description: Ability to inhibit H+/K+ stimulated ATPase activity in lympholised gastric vesicles
In DepthDetails Article