BDBM50286822 2-(2-Methyl-10H-9-oxa-1-aza-anthracen-6-yl)-propionic acid::CHEMBL176477
SMILES CC(C(O)=O)c1ccc2Oc3nc(C)ccc3Cc2c1
InChI Key InChIKey=FJDZVZSBZSMBTP-UHFFFAOYSA-N
Data  2 IC50
  Tab Delimited (TSV)   2D SDfile   Computed 3D by Vconf -m prep SDfile
Find this compound or compounds like it in BindingDB:
Activity Spreadsheet -- Enzyme Inhibition Constant Data from BindingDB
Found 2 hits for monomerid = 50286822
TargetProstaglandin G/H synthase 1(Ovis aries (Sheep))
TBA
Curated by ChEMBL
LigandPNGBDBM50286822(2-(2-Methyl-10H-9-oxa-1-aza-anthracen-6-yl)-propio...)
Affinity DataIC50:  320nM. Assay description: Inhibitory activity of the compound against COX-1 from ram seminal vesicles
In DepthDetails Article
TargetProstaglandin G/H synthase 1(RAT)
TBA
Curated by ChEMBL
LigandPNGBDBM50286822(2-(2-Methyl-10H-9-oxa-1-aza-anthracen-6-yl)-propio...)
Affinity DataIC50:  320nM. Assay description: Inhibitory activity of the compound against COX-1 from ram seminal vesicles
In DepthDetails Article