BDBM50287240 6-(2-{3-[1-Methyl-2-oxo-3-(3-m-tolyl-ureido)-2,3-dihydro-1H-benzo[e][1,4]diazepin-5-yl]-phenoxy}-acetylamino)-hexanoic acid [3-(3-piperidin-1-ylmethyl-phenoxy)-propyl]-amide::CHEMBL30701
SMILES CN1c2ccccc2C(=NC(NC(=O)Nc2cccc(C)c2)C1=O)c1cccc(OCC(=O)NCCCCCC(=O)NCCCOc2cccc(CN3CCCCC3)c2)c1
InChI Key InChIKey=PJFKIFQLCRIBRM-UHFFFAOYSA-N
Data  3 IC50
  Tab Delimited (TSV)   2D SDfile   Computed 3D by Vconf -m prep SDfile
Find this compound or compounds like it in BindingDB:
Activity Spreadsheet -- Enzyme Inhibition Constant Data from BindingDB
Found 3 hits for monomerid = 50287240
TargetCholecystokinin receptor type A(Mus musculus)
TBA
Curated by ChEMBL
LigandPNGBDBM50287240(6-(2-{3-[1-Methyl-2-oxo-3-(3-m-tolyl-ureido)-2,3-d...)
Affinity DataIC50:  3.60E+3nM. Assay description: Inhibitory activity against Cholecystokinin type A receptor
In DepthDetails Article
TargetGastrin/cholecystokinin type B receptor(Homo sapiens (Human))
TBA
Curated by ChEMBL
LigandPNGBDBM50287240(6-(2-{3-[1-Methyl-2-oxo-3-(3-m-tolyl-ureido)-2,3-d...)
Affinity DataIC50:  32nM. Assay description: Inhibitory activity against gastrin receptor
In DepthDetails Article
LigandPNGBDBM50287240(6-(2-{3-[1-Methyl-2-oxo-3-(3-m-tolyl-ureido)-2,3-d...)
Affinity DataIC50:  320nM. Assay description: Inhibitory activity against Cholecystokinin type B receptor
In DepthDetails Article