BDBM50287769 17-ethyl-1,14,20-trihydroxy-12-[2-(4-hydroxy-3-methoxycyclohexyl)-1-methyl-(E)-1-ethenyl]-22,24-dimethoxy-13,19,21,26-tetramethyl-11,27-dioxa-4-azatricyclo[21.3.1.04,9]heptacos-18-ene-2,3,10,16-tetraone::CHEMBL303852
SMILES CC[C@@H]1\C=C(C)\[C@@H](O)[C@H](C)[C@H](OC)[C@H]2O[C@](O)([C@H](C)C[C@@H]2OC)C(=O)C(=O)N2CCCC[C@H]2C(=O)O[C@@H]([C@H](C)[C@@H](O)CC1=O)C(\C)=C\[C@@H]1CC[C@@H](O)[C@@H](C1)OC
InChI Key InChIKey=RYGZCZJNNREQIG-XDYJYFMZSA-N
Data  1 IC50
  Tab Delimited (TSV)   2D SDfile   Computed 3D by Vconf -m prep SDfile
Find this compound or compounds like it in BindingDB:
Activity Spreadsheet -- Enzyme Inhibition Constant Data from BindingDB
Found 1 hit for monomerid = 50287769
TargetPeptidyl-prolyl cis-trans isomerase FKBP1A(Homo sapiens (Human))
TBA
Curated by ChEMBL
LigandPNGBDBM50287769(17-ethyl-1,14,20-trihydroxy-12-[2-(4-hydroxy-3-met...)
Affinity DataIC50:  0.700nM. Assay description: Compound was evaluated in vitro for the competitive binding to FK506 binding protein 12 versus tritiated FK-506.
In DepthDetails Article