BDBM50287819 (S)-2-(3-Methoxy-phenoxymethyl)-pyrrolidine::CHEMBL76268
SMILES COc1cccc(OC[C@@H]2CCCN2)c1
InChI Key InChIKey=OYCRGQUKCYUSFQ-JTQLQIEISA-N
Data  1 KI
  Tab Delimited (TSV)   2D SDfile   Computed 3D by Vconf -m prep SDfile
Find this compound or compounds like it in BindingDB:
Activity Spreadsheet -- Enzyme Inhibition Constant Data from BindingDB
Found 1 hit for monomerid = 50287819
TargetNeuronal acetylcholine receptor subunit alpha-10(Rattus norvegicus)
TBA
Curated by ChEMBL
LigandPNGBDBM50287819((S)-2-(3-Methoxy-phenoxymethyl)-pyrrolidine | CHEM...)
Affinity DataKi:  468nM. Assay description: Binding affinity against neuronal nicotinic acetylcholine receptor(nAChR) by using [3H]-Cytisine as radioligand in whole rat brain
In DepthDetails Article