BDBM50287857 (S)-2-(7-Chloro-indan-4-yloxymethyl)-1-methyl-pyrrolidine::CHEMBL306845
SMILES CN1CCC[C@H]1COc1ccc(Cl)c2CCCc12
InChI Key InChIKey=IDIVMUALCJKGFX-NSHDSACASA-N
Data  1 KI
  Tab Delimited (TSV)   2D SDfile   Computed 3D by Vconf -m prep SDfile
Find this compound or compounds like it in BindingDB:
Activity Spreadsheet -- Enzyme Inhibition Constant Data from BindingDB
Found 1 hit for monomerid = 50287857
TargetNeuronal acetylcholine receptor subunit alpha-10(Rattus norvegicus)
TBA
Curated by ChEMBL
LigandPNGBDBM50287857((S)-2-(7-Chloro-indan-4-yloxymethyl)-1-methyl-pyrr...)
Affinity DataKi:  1.87E+3nM. Assay description: Binding affinity against neuronal nicotinic acetylcholine receptor(nAChR) by using [3H]-Cytisine as radioligand in whole rat brain
In DepthDetails Article