BDBM50287891 CHEMBL305933::Sodium; 4-[(1R,3S)-1-hydroxy-3-((E)-3-hydroxy-oct-1-enyl)-cyclohexyl]-butyrate
SMILES CCCCCC(O)\C=C\[C@H]1CCC[C@@](O)(CCCC([O-])=O)C1
InChI Key InChIKey=QFCVPPANICHFQZ-WYYSHFPPSA-M
Data  1 IC50
  Tab Delimited (TSV)   2D SDfile   Computed 3D by Vconf -m prep SDfile
Find this compound or compounds like it in BindingDB:
Activity Spreadsheet -- Enzyme Inhibition Constant Data from BindingDB
Found 1 hit for monomerid = 50287891
TargetLeukotriene B4 receptor 1(Homo sapiens (Human))
TBA
Curated by ChEMBL
LigandPNGBDBM50287891(CHEMBL305933 | Sodium; 4-[(1R,3S)-1-hydroxy-3-((E)...)
Affinity DataIC50:  7.00E+4nM. Assay description: Compound was evaluated for inhibitory activity against LTB4 receptor in human neutrophil membranes using [3H]- LTB4 as radioligand
In DepthDetails Article