BDBM50288102 CHEMBL45496::[(S)-1-(5-Methyl-4-oxo-4H-benzo[d][1,3]oxazin-2-yl)-ethyl]-carbamic acid benzyl ester
SMILES C[C@H](NC(=O)OCc1ccccc1)c1nc2cccc(C)c2c(=O)o1
InChI Key InChIKey=PGOIRDQOPJUJMY-ZDUSSCGKSA-N
Data  2 IC50
  Tab Delimited (TSV)   2D SDfile   Computed 3D by Vconf -m prep SDfile
Find this compound or compounds like it in BindingDB:
Activity Spreadsheet -- Enzyme Inhibition Constant Data from BindingDB
Found 2 hits for monomerid = 50288102
TargetCapsid scaffolding protein(Human herpesvirus 1 (strain 17) (HHV-1) (Human her...)
TBA
Curated by ChEMBL
LigandPNGBDBM50288102(CHEMBL45496 | [(S)-1-(5-Methyl-4-oxo-4H-benzo[d][1...)
Affinity DataIC50:  1.20E+5nM. Assay description: Inhibitory concentration for peptidolytic activity against herpes simplex type-1 (HSV-1) protease at 10 uM.
In DepthDetails Article
TargetCapsid scaffolding protein(Human herpesvirus 1 (strain 17) (HHV-1) (Human her...)
TBA
Curated by ChEMBL
LigandPNGBDBM50288102(CHEMBL45496 | [(S)-1-(5-Methyl-4-oxo-4H-benzo[d][1...)
Affinity DataIC50:  1.20E+5nM. Assay description: Inhibitory activity against herpes simplex type 1 protease (HSV-1 pr).
In DepthDetails Article