BDBM50288580 (S)-4-Amino-4-[(S)-3-methyl-1-(phosphonomethyl-carbamoyl)-butylcarbamoyl]-butyric acid::(S)-4-Amino-4-[3-methyl-1-((S)-phosphonomethyl-carbamoyl)-butylcarbamoyl]-butyric acid::CHEMBL431616
SMILES CC(C)C[C@H](NC(=O)[C@@H](N)CCC(O)=O)C(=O)NCP(O)(O)=O
InChI Key InChIKey=OVTCWQXXBZNCBG-IUCAKERBSA-N
Data  1 KI
  Tab Delimited (TSV)   2D SDfile   Computed 3D by Vconf -m prep SDfile
Find this compound or compounds like it in BindingDB:
Activity Spreadsheet -- Enzyme Inhibition Constant Data from BindingDB
Found 1 hit for monomerid = 50288580
TargetGlutathionylspermidine synthase(Crithidia fasciculata)
TBA
Curated by ChEMBL
LigandPNGBDBM50288580((S)-4-Amino-4-[(S)-3-methyl-1-(phosphonomethyl-car...)
Affinity DataKi:  6.00E+4nM. Assay description: Compound was tested for linear non-competitive inhibitory activity against glutathionylspermidine synthetase.
In DepthDetails Article