BDBM50288581 2-(4-amino-2,3-dihydrobenzo[b]furan-7-ylcarboxamido)-(2S)-4-azabicyclo[2.2.2]octane::CHEMBL88263
SMILES Nc1ccc(C(=O)N[C@@H]2CN3CCC2CC3)c2OCCc12
InChI Key InChIKey=BWZIVCZPLOWYGH-CQSZACIVSA-N
Data  2 KI  1 EC50
  Tab Delimited (TSV)   2D SDfile   Computed 3D by Vconf -m prep SDfile
Find this compound or compounds like it in BindingDB:
Activity Spreadsheet -- Enzyme Inhibition Constant Data from BindingDB
Found 3 hits for monomerid = 50288581
Target5-hydroxytryptamine receptor 3A/3B(Rattus norvegicus)
TBA
Curated by ChEMBL
LigandPNGBDBM50288581(2-(4-amino-2,3-dihydrobenzo[b]furan-7-ylcarboxamid...)
Affinity DataKi:  1nM. Assay description: Binding affinity at 5-hydroxytryptamine 4 receptor in rat striatum by [3H]GR-113808 displacement.
In DepthDetails Article
Target5-hydroxytryptamine receptor 4(RAT)
TBA
Curated by ChEMBL
LigandPNGBDBM50288581(2-(4-amino-2,3-dihydrobenzo[b]furan-7-ylcarboxamid...)
Affinity DataKi: >1.00E+3nM. Assay description: Binding affinity at 5-hydroxytryptamine 4 receptor in rat striatum by [3H]GR-113808 displacement.
In DepthDetails Article
Target5-hydroxytryptamine receptor 4(RAT)
TBA
Curated by ChEMBL
LigandPNGBDBM50288581(2-(4-amino-2,3-dihydrobenzo[b]furan-7-ylcarboxamid...)
Affinity DataEC50: >1.00E+4nM. Assay description: Binding affinity at 5-hydroxytryptamine 4 receptor in rat striatum by [3H]GR-113808 displacement.
In DepthDetails Article