BDBM50288609 Alpha-ketocarbonyl derivative::CHEMBL317337
SMILES CCNC(=O)C(=O)C(CC(C)C)NC(=O)C(CCCN=C(N)N[N+]([O-])=O)NC(=O)C(CCCCCCCCC#N)C1CCCC1
InChI Key InChIKey=HBHOMGKZARQYBC-UHFFFAOYSA-N
Data  2 IC50
  Tab Delimited (TSV)   2D SDfile   Computed 3D by Vconf -m prep SDfile
Find this compound or compounds like it in BindingDB:
Activity Spreadsheet -- Enzyme Inhibition Constant Data from BindingDB
Found 2 hits for monomerid = 50288609
TargetChymotrypsin-like protease CTRL-1(Homo sapiens (Human))
TBA
Curated by ChEMBL
LigandPNGBDBM50288609(Alpha-ketocarbonyl derivative | CHEMBL317337)
Affinity DataIC50:  22nM. Assay description: Compound was tested for inhibition of chymotrypsin-like protease of proteasome from postmortem human liver and brain
In DepthDetails Article
TargetChymotrypsin-like protease CTRL-1(Homo sapiens (Human))
TBA
Curated by ChEMBL
LigandPNGBDBM50288609(Alpha-ketocarbonyl derivative | CHEMBL317337)
Affinity DataIC50:  22nM. Assay description: Compound was tested for inhibition of chymotrypsin-like protease of proteasome from postmortem human liver and brain
In DepthDetails Article