BDBM50288618 (S)-1-[(3R,4S)-4-(3-Trifluoromethyl-phenyl)-pyrrolidine-3-carbonyl]-pyrrolidine-2-carboxylic acid [(R)-5-amino-1-((1S,2S,6R,8S)-2,9,9-trimethyl-3,5-dioxa-4-bora-tricyclo[6.1.1.0*2,6*]dec-4-yl)-pentyl]-amide; dihydrochloride::CHEMBL2448355
SMILES Cl.Cl.[H][C@@]12C[C@@]([H])(C1(C)C)[C@]1(C)OB(O[C@]1([H])C2)[C@H](CCCCN)NC(=O)[C@@H]1CCCN1C(=O)[C@H]1CNC[C@@H]1c1cccc(c1)C(F)(F)F
InChI Key InChIKey=POUFIHAMCPXMQW-JMAMHEAASA-N
Data  1 KI
  Tab Delimited (TSV)   2D SDfile   Computed 3D by Vconf -m prep SDfile
Find this compound or compounds like it in BindingDB:
Activity Spreadsheet -- Enzyme Inhibition Constant Data from BindingDB
Found 1 hit for monomerid = 50288618
TargetProthrombin(Homo sapiens (Human))
TBA
Curated by ChEMBL
LigandPNGBDBM50288618((S)-1-[(3R,4S)-4-(3-Trifluoromethyl-phenyl)-pyrrol...)
Affinity DataKi:  5.60nM. Assay description: Compound was evaluated for the inhibitory activity against thrombin.
In DepthDetails Article