BDBM50288655 (Phenyl-o-tolyl-methyl)-phosphonic acid::CHEMBL107792
SMILES Cc1ccccc1C(c1ccccc1)P(O)(O)=O
InChI Key InChIKey=IQUGVYDMGPYRSD-UHFFFAOYSA-N
Data  1 IC50
  Tab Delimited (TSV)   2D SDfile   Computed 3D by Vconf -m prep SDfile
Find this compound or compounds like it in BindingDB:
Activity Spreadsheet -- Enzyme Inhibition Constant Data from BindingDB
Found 1 hit for monomerid = 50288655
TargetProstatic acid phosphatase(Homo sapiens (Human))
TBA
Curated by ChEMBL
LigandPNGBDBM50288655((Phenyl-o-tolyl-methyl)-phosphonic acid | CHEMBL10...)
Affinity DataIC50:  3.80E+4nM. Assay description: Inhibition of human prostatic acid phosphatase was determined as inhibition of the hydrolysis of tyrosine phosphate
In DepthDetails Article